Reaction Details
TargetVasopressin V2 receptor
LigandBDBM50204026
Substrate/Competitorn/a
Meas. Tech.ChEMBL_215011 (CHEMBL818809)
IC50<10±n/a nM
Citation Cho, HMurakami, KNakanishi, HFujisawa, AIsoshima, HNiwa, MHayakawa, KHase, YUchida, IWatanabe, HWakitani, KAisaka, K Synthesis and structure-activity relationships of 5,6,7,8-tetrahydro-4H-thieno[3,2-b]azepine derivatives: novel arginine vasopressin antagonists. J Med Chem47:101-9 (2003) 
 
Vasopressin V2 receptor
Name:Vasopressin V2 receptor
Type:G-protein coupled receptor
Mol. Mass.:40761.85
Organism:Rattus norvegicus (Rat)
Description:n/a
Residue:371
BDBM50204026
NameBDBM50204026
Synonyms:CHEMBL369150
TypeSmall organic molecule
Emp. Form.C28H24N2O3S
Mol. Mass.468.567
SMILESOc1cc(ccc1NC(=O)c1ccccc1-c1ccccc1)C(=O)N1CCCCc2sccc12