Reaction Details
TargetGenome polyprotein
LigandBDBM50137959
Substrate/Competitorn/a
Meas. Tech.ChEBML_143470
IC50 120±n/a nM
Citation Goudreau, NCameron, DRBonneau, PGorys, VPlouffe, CPoirier, MLamarre, DLlinas-Brunet, M NMR structural characterization of peptide inhibitors bound to the Hepatitis C virus NS3 protease: design of a new P2 substituent. J Med Chem47:123-32 (2003) 
 
Genome polyprotein
Name:Genome polyprotein
Type:Protein
Mol. Mass.:67067.41
Organism:Hepatitis C virus
Description:A3EZI9
Residue:631
BDBM50137959
NameBDBM50137959
Synonyms:1-{[(R)-(S)-1-[(S)-2-((S)-2-Acetylamino-2-cyclohexyl-acetylamino)-3-methyl-butyryl]-4-(biphenyl-3-yloxy)-pyrrolidine-2-carbonyl]-amino}-2-vinyl-cyclopropanecarboxylic acid | CHEMBL368579
TypeSmall organic molecule
Emp. Form.C38H48N4O7
Mol. Mass.672.8103
SMILESCC(C)[C@H](NC(=O)[C@@H](NC(C)=O)C1CCCCC1)C(=O)N1C[C@@H](C[C@H]1C(=O)N[C@@]1(C[C@H]1C=C)C(O)=O)Oc1cccc(c1)-c1ccccc1