Reaction Details
TargetGenome polyprotein
LigandBDBM50093011
Substrate/Competitorn/a
Meas. Tech.ChEMBL_143469 (CHEMBL750355)
IC50 390±n/a nM
Citation Goudreau, NCameron, DRBonneau, PGorys, VPlouffe, CPoirier, MLamarre, DLlinas-Brunet, M NMR structural characterization of peptide inhibitors bound to the Hepatitis C virus NS3 protease: design of a new P2 substituent. J Med Chem47:123-32 (2003) 
 
Genome polyprotein
Name:Genome polyprotein
Type:Protein
Mol. Mass.:67067.41
Organism:Hepatitis C virus
Description:A3EZI9
Residue:631
BDBM50093011
NameBDBM50093011
Synonyms:1-((2S,4R)-1-((S)-2-((S)-2-acetamido-2-cyclohexylacetamido)-3-methylbutanoyl)-4-(naphthalen-1-ylmethoxy)pyrrolidine-2-carboxamido)cyclopropanecarboxylic acid 1-{[1-[2-(2-Acetylamino-2-cyclohexyl-acetylamino)-3-methyl-butyryl]-4-(naphthalen-1-ylmethoxy)-pyrrolidine-2-carbonyl]-amino}-cyclopropanecarboxylic acid | CHEMBL75558
TypeSmall organic molecule
Emp. Form.C35H46N4O7
Mol. Mass.634.7623
SMILESCC(C)[C@H](NC(=O)[C@@H](NC(C)=O)C1CCCCC1)C(=O)N1C[C@@H](C[C@H]1C(=O)NC1(CC1)C(O)=O)OCc1cccc2ccccc12