Reaction Details
TargetMu-type opioid receptor
LigandBDBM50137996
Substrate/Competitorn/a
Meas. Tech.ChEMBL_145149 (CHEMBL755953)
Ki 0.06±n/a nM
Citation Zhang, AXiong, WBidlack, JMHilbert, JEKnapp, BIWentland, MPNeumeyer, JL 10-Ketomorphinan and 3-substituted-3-desoxymorphinan analogues as mixed kappa and micro opioid ligands: synthesis and biological evaluation of their binding affinity at opioid receptors. J Med Chem47:165-74 (2003) 
 
Mu-type opioid receptor
Name:Mu-type opioid receptor
Type:Enzyme Catalytic Domain
Mol. Mass.:11165.58
Organism:GUINEA PIG
Description:P97266
Residue:98
BDBM50137996
NameBDBM50137996
Synonyms:3-Carboxamido-N-cyclopropylmethylmorphinan | CHEMBL300033
TypeSmall organic molecule
Emp. Form.C21H28N2O
Mol. Mass.324.4598
SMILESNC(=O)c1ccc2C[C@@H]3[C@@H]4CCCC[C@]4(CCN3CC3CC3)c2c1