Reaction Details
TargetMu-type opioid receptor
LigandBDBM50138016
Substrate/Competitorn/a
Meas. Tech.ChEMBL_145149 (CHEMBL755953)
Ki 8.5±n/a nM
Citation Zhang, AXiong, WBidlack, JMHilbert, JEKnapp, BIWentland, MPNeumeyer, JL 10-Ketomorphinan and 3-substituted-3-desoxymorphinan analogues as mixed kappa and micro opioid ligands: synthesis and biological evaluation of their binding affinity at opioid receptors. J Med Chem47:165-74 (2003) 
 
Mu-type opioid receptor
Name:Mu-type opioid receptor
Type:Enzyme Catalytic Domain
Mol. Mass.:11165.58
Organism:GUINEA PIG
Description:P97266
Residue:98
BDBM50138016
NameBDBM50138016
Synonyms:3-Aminomethyl-N-cyclobutylmethylmorphinan | CHEMBL298688
TypeSmall organic molecule
Emp. Form.C22H32N2
Mol. Mass.324.5029
SMILESNCc1ccc2C[C@@H]3[C@@H]4CCCC[C@]4(CCN3CC3CCC3)c2c1