Reaction Details
TargetDelta-type opioid receptor
LigandBDBM50138011
Substrate/Competitorn/a
Meas. Tech.ChEMBL_147025 (CHEMBL753666)
Ki 9.7±n/a nM
Citation Zhang, AXiong, WBidlack, JMHilbert, JEKnapp, BIWentland, MPNeumeyer, JL 10-Ketomorphinan and 3-substituted-3-desoxymorphinan analogues as mixed kappa and micro opioid ligands: synthesis and biological evaluation of their binding affinity at opioid receptors. J Med Chem47:165-74 (2003) 
 
Delta-type opioid receptor
Name:Delta-type opioid receptor
Type:G Protein-Coupled Receptor (GPCR)
Mol. Mass.:40382.98
Organism:Homo sapiens (Human)
Description:Competition binding assays were carried out using membrane preparations from transfected HN9.10 cells that constitutively expressed the delta opioid receptor.
Residue:372
BDBM50138011
NameBDBM50138011
Synonyms:3-Hydroxy-10-keto-N-(2-phenylethyl)morphinan | CHEMBL48390
TypeSmall organic molecule
Emp. Form.C24H27NO2
Mol. Mass.361.4767
SMILESOc1ccc2C(=O)[C@@H]3[C@@H]4CCCC[C@]4(CCN3CCc3ccccc3)c2c1