Reaction Details
TargetKappa-type opioid receptor
LigandBDBM50138002
Substrate/Competitorn/a
Meas. Tech.ChEMBL_146368 (CHEMBL759288)
Ki 7.4±n/a nM
Citation Zhang, AXiong, WBidlack, JMHilbert, JEKnapp, BIWentland, MPNeumeyer, JL 10-Ketomorphinan and 3-substituted-3-desoxymorphinan analogues as mixed kappa and micro opioid ligands: synthesis and biological evaluation of their binding affinity at opioid receptors. J Med Chem47:165-74 (2003) 
 
Kappa-type opioid receptor
Name:Kappa-type opioid receptor
Type:G Protein-Coupled Receptor (GPCR)
Mol. Mass.:42744.99
Organism:Cavia porcellus (domestic guinea pig)
Description:P41144
Residue:380
BDBM50138002
NameBDBM50138002
Synonyms:3-Hydroxy-10-keto-N-(3,3-dimethylallyl)morphinan | CHEMBL295402
TypeSmall organic molecule
Emp. Form.C21H27NO2
Mol. Mass.325.4446
SMILES[#6]\[#6](-[#6])=[#6]\[#6]-[#7]-1-[#6]-[#6][C@]23[#6]-[#6]-[#6]-[#6]-[#6@H]2-[#6@H]-1-[#6](=O)-c1ccc(-[#8])cc31