Reaction Details
TargetCytochrome P450 2C19
LigandBDBM50136037
Substrate/Competitorn/a
Meas. Tech.ChEBML_51522
IC50 7±n/a nM
Citation Nakamura, TKakinuma, HUmemiya, HAmada, HMiyata, NTaniguchi, KBando, KSato, M Imidazole derivatives as new potent and selective 20-HETE synthase inhibitors. Bioorg Med Chem Lett14:333-6 (2003) Cytochrome P450 2C19
Name:Cytochrome P450 2C19
Type:Enzyme
Mol. Mass.:55935.47
Organism:Homo sapiens (Human)
Description:P33261
Residue:490
BDBM50136037
NameBDBM50136037
Synonyms:1-(4-Butoxy-phenyl)-1H-imidazole | CHEMBL112532
TypeSmall organic molecule
Emp. Form.C13H16N2O
Mol. Mass.216.2789
SMILESCCCCOc1ccc(cc1)-n1ccnc1