Reaction Details
TargetReverse transcriptase/RNaseH
LigandBDBM50138404
Substrate/Competitorn/a
Meas. Tech.ChEBML_80151
Kd 64000±n/a nM
Citation Chong, YChoo, HChu, CK Effects of fluorine substitution of cytosine analogues on the binding affinity to HIV-1 reverse transcriptase. Bioorg Med Chem Lett14:437-40 (2003) Reverse transcriptase/RNaseH
Name:Reverse transcriptase/RNaseH
Type:PROTEIN
Mol. Mass.:65229.15
Organism:Human immunodeficiency virus 1
Description:ChEMBL_1473730
Residue:566
BDBM50138404
NameBDBM50138404
Synonyms:CHEMBL138054 | [(2R,5S)-5-(4-amino-5-fluoro-2-oxopyrimidin-1(2H)-yl)-4-fluoro-2,5-dihydrofuran-2-yl]methyl tetrahydrogen triphosphate
TypeSmall organic molecule
Emp. Form.C9H12F2N3O12P3
Mol. Mass.485.1226
SMILESNc1nc(=O)n(cc1F)[C@H]1O[C@@H](COP(O)(=O)OP(O)(=O)OP(O)(O)=O)C=C1F