Reaction Details
Target5-hydroxytryptamine receptor 1A
LigandBDBM50138478
Substrate/Competitorn/a
Meas. Tech.ChEMBL_674 (CHEMBL615750)
IC50 21±n/a nM
Citation Gilbert, AMStack, GPNilakantan, RKodah, JTran, MScerni, RShi, XSmith, DLAndree, TH Modulation of selective serotonin reuptake inhibitor and 5-HT1A antagonist activity in 8-aza-bicyclo[3.2.1]octane derivatives of 2,3-dihydro-1,4-benzodioxane. Bioorg Med Chem Lett14:515-8 (2003) 5-hydroxytryptamine receptor 1A
Name:5-hydroxytryptamine receptor 1A
Type:n/a
Mol. Mass.:46122.49
Organism:Homo sapiens (Human)
Description:n/a
Residue:422
BDBM50138478
NameBDBM50138478
Synonyms:(1R,3R,5S)-8-((S)-8-Methoxy-2,3-dihydro-benzo[1,4]dioxin-2-ylmethyl)-3-naphthalen-2-yl-8-aza-bicyclo[3.2.1]octan-3-ol | CHEMBL146751
TypeSmall organic molecule
Emp. Form.C27H29NO4
Mol. Mass.431.5235
SMILESCOc1cccc2OC[C@H](CN3[C@H]4CC[C@@H]3C[C@](O)(C4)c3ccc4ccccc4c3)Oc12