Reaction Details
Target5-hydroxytryptamine receptor 1A
LigandBDBM50138482
Substrate/Competitorn/a
Meas. Tech.ChEBML_676
Ki 62±n/a nM
Citation Gilbert, AMStack, GPNilakantan, RKodah, JTran, MScerni, RShi, XSmith, DLAndree, TH Modulation of selective serotonin reuptake inhibitor and 5-HT1A antagonist activity in 8-aza-bicyclo[3.2.1]octane derivatives of 2,3-dihydro-1,4-benzodioxane. Bioorg Med Chem Lett14:515-8 (2003) 5-hydroxytryptamine receptor 1A
Name:5-hydroxytryptamine receptor 1A
Type:n/a
Mol. Mass.:46122.49
Organism:Homo sapiens (Human)
Description:n/a
Residue:422
BDBM50138482
NameBDBM50138482
Synonyms:(1R,3R,5S)-8-((S)-8-Ethoxy-2,3-dihydro-benzo[1,4]dioxin-2-ylmethyl)-3-pyridin-2-yl-8-aza-bicyclo[3.2.1]octan-3-ol | CHEMBL357985
TypeSmall organic molecule
Emp. Form.C23H28N2O4
Mol. Mass.396.4794
SMILESCCOc1cccc2OC[C@H](CN3[C@H]4CC[C@@H]3C[C@](O)(C4)c3ccccn3)Oc12