Reaction Details
TargetAdenosine receptor A1
LigandBDBM50138521
Substrate/Competitorn/a
Meas. Tech.ChEBML_29728
Ki 96±n/a nM
Citation Palle, VPVarkhedkar, VIbrahim, PAhmed, HLi, ZGao, ZOzeck, MWu, YZeng, DWu, LLeung, KChu, NZablocki, JA Affinity and intrinsic efficacy (IE) of 5'-carbamoyl adenosine analogues for the A1 adenosine receptor--efforts towards the discovery of a chronic ventricular rate control agent for the treatment of atrial fibrillation (AF). Bioorg Med Chem Lett14:535-9 (2003) Adenosine receptor A1
Name:Adenosine receptor A1
Type:G Protein-Coupled Receptor (GPCR)
Mol. Mass.:36520.92
Organism:Homo sapiens (Human)
Description:P30542
Residue:326
BDBM50138521
NameBDBM50138521
Synonyms:CHEMBL149790 | Methyl-carbamic acid (2R,3S,4R)-5-{2-chloro-6-[(R)-(tetrahydro-furan-3-yl)amino]-purin-9-yl}-3,4-dihydroxy-tetrahydro-furan-2-ylmethyl ester
TypeSmall organic molecule
Emp. Form.C16H21ClN6O6
Mol. Mass.428.828
SMILESCNC(=O)OC[C@H]1OC([C@H](O)[C@@H]1O)n1cnc2c(NC3CCOC3)nc(Cl)nc12