Reaction Details
TargetPeroxisomal acyl-coenzyme A oxidase 1
LigandBDBM50138600
Substrate/Competitorn/a
Meas. Tech.ChEBML_154606
IC50 5700±n/a nM
Citation Koltun, DOMarquart, TAShenk, KDElzein, ELi, YNguyen, MKerwar, SZeng, DChu, NSoohoo, DHao, JMaydanik, VYLustig, DANg, KJFraser, HZablocki, JA New fatty acid oxidation inhibitors with increased potency lacking adverse metabolic and electrophysiological properties. Bioorg Med Chem Lett14:549-52 (2003) Peroxisomal acyl-coenzyme A oxidase 1
Name:Peroxisomal acyl-coenzyme A oxidase 1
Type:PROTEIN
Mol. Mass.:74693.04
Organism:Rattus norvegicus
Description:ChEMBL_311972
Residue:661
BDBM50138600
NameBDBM50138600
Synonyms:CHEMBL152941 | N-Benzo[1,2,5]thiadiazol-4-yl-2-{4-[(R)-2-hydroxy-3-(2-methyl-benzothiazol-5-yloxy)-propyl]-piperazin-1-yl}-acetamide
TypeSmall organic molecule
Emp. Form.C23H26N6O3S2
Mol. Mass.498.621
SMILESCc1nc2cc(OC[C@H](O)CN3CCN(CC(=O)Nc4cccc5nsnc45)CC3)ccc2s1