Reaction Details
TargetPeroxisomal acyl-coenzyme A oxidase 1
LigandBDBM50138607
Substrate/Competitorn/a
Meas. Tech.ChEBML_154606
IC50 77±n/a nM
Citation Koltun, DOMarquart, TAShenk, KDElzein, ELi, YNguyen, MKerwar, SZeng, DChu, NSoohoo, DHao, JMaydanik, VYLustig, DANg, KJFraser, HZablocki, JA New fatty acid oxidation inhibitors with increased potency lacking adverse metabolic and electrophysiological properties. Bioorg Med Chem Lett14:549-52 (2003) Peroxisomal acyl-coenzyme A oxidase 1
Name:Peroxisomal acyl-coenzyme A oxidase 1
Type:PROTEIN
Mol. Mass.:74693.04
Organism:Rattus norvegicus
Description:ChEMBL_311972
Residue:661
BDBM50138607
NameBDBM50138607
Synonyms:2-{4-[(R)-2-Hydroxy-3-(2-methyl-benzothiazol-5-yloxy)-propyl]-piperazin-1-yl}-N-(S)-1,2,3,4-tetrahydro-naphthalen-1-yl-acetamide | CHEMBL149470
TypeSmall organic molecule
Emp. Form.C27H34N4O3S
Mol. Mass.494.649
SMILESCc1nc2cc(OC[C@H](O)CN3CCN(CC(=O)N[C@H]4CCCc5ccccc45)CC3)ccc2s1