Reaction Details
TargetPeroxisomal acyl-coenzyme A oxidase 1
LigandBDBM50138612
Substrate/Competitorn/a
Meas. Tech.ChEBML_154606
IC50 8500±n/a nM
Citation Koltun, DOMarquart, TAShenk, KDElzein, ELi, YNguyen, MKerwar, SZeng, DChu, NSoohoo, DHao, JMaydanik, VYLustig, DANg, KJFraser, HZablocki, JA New fatty acid oxidation inhibitors with increased potency lacking adverse metabolic and electrophysiological properties. Bioorg Med Chem Lett14:549-52 (2003) Peroxisomal acyl-coenzyme A oxidase 1
Name:Peroxisomal acyl-coenzyme A oxidase 1
Type:PROTEIN
Mol. Mass.:74693.04
Organism:Rattus norvegicus
Description:ChEMBL_311972
Residue:661
BDBM50138612
NameBDBM50138612
Synonyms:2-{4-[(R)-2-Hydroxy-3-(2-methyl-benzothiazol-5-yloxy)-propyl]-piperazin-1-yl}-N-((S)-1-naphthalen-1-yl-ethyl)-acetamide | CHEMBL150464
TypeSmall organic molecule
Emp. Form.C29H34N4O3S
Mol. Mass.518.67
SMILESC[C@H](NC(=O)CN1CCN(C[C@@H](O)COc2ccc3sc(C)nc3c2)CC1)c1cccc2ccccc12