Reaction Details
TargetCytochrome P450 3A4
LigandBDBM50138602
Substrate/Competitorn/a
Meas. Tech.ChEBML_51895
IC50 37000±n/a nM
Citation Koltun, DOMarquart, TAShenk, KDElzein, ELi, YNguyen, MKerwar, SZeng, DChu, NSoohoo, DHao, JMaydanik, VYLustig, DANg, KJFraser, HZablocki, JA New fatty acid oxidation inhibitors with increased potency lacking adverse metabolic and electrophysiological properties. Bioorg Med Chem Lett14:549-52 (2003) Cytochrome P450 3A4
Name:Cytochrome P450 3A4
Type:Enzyme
Mol. Mass.:57349.57
Organism:Homo sapiens (Human)
Description:n/a
Residue:503
BDBM50138602
NameBDBM50138602
Synonyms:CHEMBL152968 | N-Biphenyl-3-yl-2-{4-[(R)-2-hydroxy-3-(2-methyl-benzothiazol-5-yloxy)-propyl]-piperazin-1-yl}-acetamide
TypeSmall organic molecule
Emp. Form.C29H32N4O3S
Mol. Mass.516.654
SMILESCc1nc2cc(OC[C@H](O)CN3CCN(CC(=O)Nc4cccc(c4)-c4ccccc4)CC3)ccc2s1