Reaction Details
TargetPeroxisomal acyl-coenzyme A oxidase 1
LigandBDBM50138629
Substrate/Competitorn/a
Meas. Tech.ChEBML_154606
IC50 610±n/a nM
Citation Koltun, DOMarquart, TAShenk, KDElzein, ELi, YNguyen, MKerwar, SZeng, DChu, NSoohoo, DHao, JMaydanik, VYLustig, DANg, KJFraser, HZablocki, JA New fatty acid oxidation inhibitors with increased potency lacking adverse metabolic and electrophysiological properties. Bioorg Med Chem Lett14:549-52 (2003) Peroxisomal acyl-coenzyme A oxidase 1
Name:Peroxisomal acyl-coenzyme A oxidase 1
Type:PROTEIN
Mol. Mass.:74693.04
Organism:Rattus norvegicus
Description:ChEMBL_311972
Residue:661
BDBM50138629
NameBDBM50138629
Synonyms:2-{4-[(R)-2-Hydroxy-3-(2-methyl-benzothiazol-5-yloxy)-propyl]-piperazin-1-yl}-N-(5,6,7,8-tetrahydro-naphthalen-2-yl)-acetamide | CHEMBL348498
TypeSmall organic molecule
Emp. Form.C27H34N4O3S
Mol. Mass.494.649
SMILESCc1nc2cc(OC[C@H](O)CN3CCN(CC(=O)Nc4ccc5CCCCc5c4)CC3)ccc2s1