Reaction Details
TargetCytochrome P450 2C9
LigandBDBM50138598
Substrate/Competitorn/a
Meas. Tech.ChEBML_51528
IC50 30000±n/a nM
Citation Koltun, DOMarquart, TAShenk, KDElzein, ELi, YNguyen, MKerwar, SZeng, DChu, NSoohoo, DHao, JMaydanik, VYLustig, DANg, KJFraser, HZablocki, JA New fatty acid oxidation inhibitors with increased potency lacking adverse metabolic and electrophysiological properties. Bioorg Med Chem Lett14:549-52 (2003) Cytochrome P450 2C9
Name:Cytochrome P450 2C9
Type:Enzyme
Mol. Mass.:55636.33
Organism:Homo sapiens (Human)
Description:P11712
Residue:490
BDBM50138598
NameBDBM50138598
Synonyms:CHEMBL153741 | N-Biphenyl-4-yl-2-{4-[(R)-2-hydroxy-3-(2-methyl-benzothiazol-5-yloxy)-propyl]-piperazin-1-yl}-acetamide
TypeSmall organic molecule
Emp. Form.C29H32N4O3S
Mol. Mass.516.654
SMILESCc1nc2cc(OC[C@H](O)CN3CCN(CC(=O)Nc4ccc(cc4)-c4ccccc4)CC3)ccc2s1