Reaction Details
TargetUrokinase-type plasminogen activator
LigandBDBM50138664
Substrate/Competitorn/a
Meas. Tech.ChEMBL_213154 (CHEMBL815981)
Ki 517±n/a nM
Citation Wendt, MDRockway, TWGeyer, AMcClellan, WWeitzberg, MZhao, XMantei, RNienaber, VLStewart, KKlinghofer, VGiranda, VL Identification of novel binding interactions in the development of potent, selective 2-naphthamidine inhibitors of urokinase. Synthesis, structural analysis, and SAR of N-phenyl amide 6-substitution. J Med Chem47:303-24 (2004) 
 
Urokinase-type plasminogen activator
Name:Urokinase-type plasminogen activator
Type:Enzyme
Mol. Mass.:48528.62
Organism:Homo sapiens (Human)
Description:P00749
Residue:431
BDBM50138664
NameBDBM50138664
Synonyms:6-Carbamimidoyl-naphthalene-2-carboxylic acid (3-phenoxy-phenyl)-amide | CHEMBL110027
TypeSmall organic molecule
Emp. Form.C24H19N3O2
Mol. Mass.381.4266
SMILESNC(=N)c1ccc2cc(ccc2c1)C(=O)Nc1cccc(Oc2ccccc2)c1