Reaction Details
TargetSerine protease 1
LigandBDBM50138666
Substrate/Competitorn/a
Meas. Tech.ChEMBL_212906 (CHEMBL819934)
Ki 260±n/a nM
Citation Wendt, MDRockway, TWGeyer, AMcClellan, WWeitzberg, MZhao, XMantei, RNienaber, VLStewart, KKlinghofer, VGiranda, VL Identification of novel binding interactions in the development of potent, selective 2-naphthamidine inhibitors of urokinase. Synthesis, structural analysis, and SAR of N-phenyl amide 6-substitution. J Med Chem47:303-24 (2004) 
 
Serine protease 1
Name:Serine protease 1
Type:Enzyme
Mol. Mass.:26557.80
Organism:Homo sapiens (Human)
Description:P07477
Residue:247
BDBM50138666
NameBDBM50138666
Synonyms:6-Carbamimidoyl-naphthalene-2-carboxylic acid (4-hydroxymethyl-phenyl)-amide | CHEMBL111432
TypeSmall organic molecule
Emp. Form.C19H17N3O2
Mol. Mass.319.3572
SMILESNC(=N)c1ccc2cc(ccc2c1)C(=O)Nc1ccc(CO)cc1