Reaction Details
TargetSerine protease 1
LigandBDBM50138667
Substrate/Competitorn/a
Meas. Tech.ChEMBL_212906 (CHEMBL819934)
Ki 42±n/a nM
Citation Wendt, MDRockway, TWGeyer, AMcClellan, WWeitzberg, MZhao, XMantei, RNienaber, VLStewart, KKlinghofer, VGiranda, VL Identification of novel binding interactions in the development of potent, selective 2-naphthamidine inhibitors of urokinase. Synthesis, structural analysis, and SAR of N-phenyl amide 6-substitution. J Med Chem47:303-24 (2004) 
 
Serine protease 1
Name:Serine protease 1
Type:Enzyme
Mol. Mass.:26557.80
Organism:Homo sapiens (Human)
Description:P07477
Residue:247
BDBM50138667
NameBDBM50138667
Synonyms:6-Carbamimidoyl-naphthalene-2-carboxylic acid (1-isopropyl-3,4-dihydro-isoquinolin-7-yl)-amide 6-carbamimidoyl-N-(1-isopropyl-3,4-dihydroisoquinolin-7-yl)-2-naphthamide | CHEMBL109367
TypeSmall organic molecule
Emp. Form.C24H24N4O
Mol. Mass.384.4736
SMILESCC(C)C1=NCCc2ccc(NC(=O)c3ccc4cc(ccc4c3)C(N)=N)cc12