Reaction Details
TargetSerine protease 1
LigandBDBM50138669
Substrate/Competitorn/a
Meas. Tech.ChEMBL_212906 (CHEMBL819934)
Ki 115±n/a nM
Citation Wendt, MDRockway, TWGeyer, AMcClellan, WWeitzberg, MZhao, XMantei, RNienaber, VLStewart, KKlinghofer, VGiranda, VL Identification of novel binding interactions in the development of potent, selective 2-naphthamidine inhibitors of urokinase. Synthesis, structural analysis, and SAR of N-phenyl amide 6-substitution. J Med Chem47:303-24 (2004) 
 
Serine protease 1
Name:Serine protease 1
Type:Enzyme
Mol. Mass.:26557.80
Organism:Homo sapiens (Human)
Description:P07477
Residue:247
BDBM50138669
NameBDBM50138669
Synonyms:6-Carbamimidoyl-naphthalene-2-carboxylic acid (1-isobutyl-1,2,3,4-tetrahydro-isoquinolin-7-yl)-amide | CHEMBL109535
TypeSmall organic molecule
Emp. Form.C25H28N4O
Mol. Mass.400.516
SMILESCC(C)CC1NCCc2ccc(NC(=O)c3ccc4cc(ccc4c3)C(N)=N)cc12