Reaction Details
TargetTissue-type plasminogen activator
LigandBDBM50138674
Substrate/Competitorn/a
Meas. Tech.ChEMBL_208066 (CHEMBL814417)
Ki 3390±n/a nM
Citation Wendt, MDRockway, TWGeyer, AMcClellan, WWeitzberg, MZhao, XMantei, RNienaber, VLStewart, KKlinghofer, VGiranda, VL Identification of novel binding interactions in the development of potent, selective 2-naphthamidine inhibitors of urokinase. Synthesis, structural analysis, and SAR of N-phenyl amide 6-substitution. J Med Chem47:303-24 (2004) 
 
Tissue-type plasminogen activator
Name:Tissue-type plasminogen activator
Type:Enzyme
Mol. Mass.:62931.08
Organism:Homo sapiens (Human)
Description:n/a
Residue:562
BDBM50138674
NameBDBM50138674
Synonyms:6-Carbamimidoyl-naphthalene-2-carboxylic acid (3-cyclopentyloxy-phenyl)-amide 6-carbamimidoyl-N-(3-(cyclopentyloxy)phenyl)-2-naphthamide | CHEMBL111575
TypeSmall organic molecule
Emp. Form.C23H23N3O2
Mol. Mass.373.4476
SMILESNC(=N)c1ccc2cc(ccc2c1)C(=O)Nc1cccc(OC2CCCC2)c1