Reaction Details
TargetProthrombin
LigandBDBM50138658
Substrate/Competitorn/a
Meas. Tech.ChEMBL_208336 (CHEMBL813568)
Ki 10160±n/a nM
Citation Wendt, MDRockway, TWGeyer, AMcClellan, WWeitzberg, MZhao, XMantei, RNienaber, VLStewart, KKlinghofer, VGiranda, VL Identification of novel binding interactions in the development of potent, selective 2-naphthamidine inhibitors of urokinase. Synthesis, structural analysis, and SAR of N-phenyl amide 6-substitution. J Med Chem47:303-24 (2004) 
 
Prothrombin
Name:Prothrombin
Type:Protein
Mol. Mass.:70029.57
Organism:Homo sapiens (Human)
Description:P00734
Residue:622
BDBM50138658
NameBDBM50138658
Synonyms:6-Carbamimidoyl-naphthalene-2-carboxylic acid (1-cyclopentyl-1,2,3,4-tetrahydro-isoquinolin-7-yl)-amide | CHEMBL111338
TypeSmall organic molecule
Emp. Form.C26H28N4O
Mol. Mass.412.5267
SMILESNC(=N)c1ccc2cc(ccc2c1)C(=O)Nc1ccc2CCNC(C3CCCC3)c2c1