Reaction Details
TargetProthrombin
LigandBDBM50138676
Substrate/Competitorn/a
Meas. Tech.ChEMBL_208336 (CHEMBL813568)
Ki 21600±n/a nM
Citation Wendt, MDRockway, TWGeyer, AMcClellan, WWeitzberg, MZhao, XMantei, RNienaber, VLStewart, KKlinghofer, VGiranda, VL Identification of novel binding interactions in the development of potent, selective 2-naphthamidine inhibitors of urokinase. Synthesis, structural analysis, and SAR of N-phenyl amide 6-substitution. J Med Chem47:303-24 (2004) 
 
Prothrombin
Name:Prothrombin
Type:Protein
Mol. Mass.:70029.57
Organism:Homo sapiens (Human)
Description:P00734
Residue:622
BDBM50138676
NameBDBM50138676
Synonyms:6-Carbamimidoyl-naphthalene-2-carboxylic acid (3-cyclopentyloxy-5-isopropoxy-phenyl)-amide | CHEMBL418839
TypeSmall organic molecule
Emp. Form.C26H29N3O3
Mol. Mass.431.5268
SMILESCC(C)Oc1cc(NC(=O)c2ccc3cc(ccc3c2)C(N)=N)cc(OC2CCCC2)c1