Reaction Details
TargetPlasminogen
LigandBDBM50138662
Substrate/Competitorn/a
Meas. Tech.ChEMBL_155235 (CHEMBL764725)
Ki 16000±n/a nM
Citation Wendt, MDRockway, TWGeyer, AMcClellan, WWeitzberg, MZhao, XMantei, RNienaber, VLStewart, KKlinghofer, VGiranda, VL Identification of novel binding interactions in the development of potent, selective 2-naphthamidine inhibitors of urokinase. Synthesis, structural analysis, and SAR of N-phenyl amide 6-substitution. J Med Chem47:303-24 (2004) 
 
Plasminogen
Name:Plasminogen
Type:Enzyme
Mol. Mass.:90579.18
Organism:Homo sapiens (Human)
Description:n/a
Residue:810
BDBM50138662
NameBDBM50138662
Synonyms:6-Carbamimidoyl-naphthalene-2-carboxylic acid (4-aminomethyl-phenyl)-amide CHEMBL324168 uPa_9
TypeSmall organic molecule
Emp. Form.C19H18N4O
Mol. Mass.318.3724
SMILESNCc1ccc(NC(=O)c2ccc3cc(ccc3c2)C(N)=N)cc1