Reaction Details
TargetPlasma kallikrein
LigandBDBM50138661
Substrate/Competitorn/a
Meas. Tech.ChEMBL_92235 (CHEMBL703580)
Ki 4300±n/a nM
Citation Wendt, MDRockway, TWGeyer, AMcClellan, WWeitzberg, MZhao, XMantei, RNienaber, VLStewart, KKlinghofer, VGiranda, VL Identification of novel binding interactions in the development of potent, selective 2-naphthamidine inhibitors of urokinase. Synthesis, structural analysis, and SAR of N-phenyl amide 6-substitution. J Med Chem47:303-24 (2004) 
 
Plasma kallikrein
Name:Plasma kallikrein
Type:Protein
Mol. Mass.:71391.16
Organism:Homo sapiens (Human)
Description:P03952
Residue:638
BDBM50138661
NameBDBM50138661
Synonyms:6-Carbamimidoyl-naphthalene-2-carboxylic acid (3,5-diisopropoxy-phenyl)-amide | CHEMBL111543
TypeSmall organic molecule
Emp. Form.C24H27N3O3
Mol. Mass.405.4895
SMILESCC(C)Oc1cc(NC(=O)c2ccc3cc(ccc3c2)C(N)=N)cc(OC(C)C)c1