Reaction Details
TargetPlasminogen
LigandBDBM50138675
Substrate/Competitorn/a
Meas. Tech.ChEMBL_155235 (CHEMBL764725)
Ki 1970±n/a nM
Citation Wendt, MDRockway, TWGeyer, AMcClellan, WWeitzberg, MZhao, XMantei, RNienaber, VLStewart, KKlinghofer, VGiranda, VL Identification of novel binding interactions in the development of potent, selective 2-naphthamidine inhibitors of urokinase. Synthesis, structural analysis, and SAR of N-phenyl amide 6-substitution. J Med Chem47:303-24 (2004) 
 
Plasminogen
Name:Plasminogen
Type:Enzyme
Mol. Mass.:90579.18
Organism:Homo sapiens (Human)
Description:n/a
Residue:810
BDBM50138675
NameBDBM50138675
Synonyms:6-Carbamimidoyl-naphthalene-2-carboxylic acid (4-carbamoyl-phenyl)-amide | CHEMBL320749
TypeSmall organic molecule
Emp. Form.C19H16N4O2
Mol. Mass.332.3559
SMILESNC(=N)c1ccc2cc(ccc2c1)C(=O)Nc1ccc(cc1)C(N)=O