Reaction Details
TargetMatrix metalloproteinase-9
LigandBDBM50138685
Substrate/Competitorn/a
Meas. Tech.ChEMBL_105372 (CHEMBL714544)
Ki 35600±n/a nM
Citation Matziari, MBeau, FCuniasse, PDive, VYiotakis, A Evaluation of P1'-diversified phosphinic peptides leads to the development of highly selective inhibitors of MMP-11. J Med Chem47:325-36 (2004) 
 
Matrix metalloproteinase-9
Name:Matrix metalloproteinase-9
Type:Enzyme
Mol. Mass.:78452.28
Organism:Homo sapiens (Human)
Description:P14780
Residue:707
BDBM50138685
NameBDBM50138685
Synonyms:(1-Benzyloxycarbonylamino-2-phenyl-ethyl)-[2-[1-carbamoyl-2-(1H-indol-3-yl)-ethylcarbamoyl]-3-(2-methoxy-phenylsulfanyl)-propyl]-phosphinic acid | CHEMBL324891
TypeSmall organic molecule
Emp. Form.C38H41N4O7PS
Mol. Mass.728.794
SMILESCOc1ccccc1SCC(CP(O)(=O)C(Cc1ccccc1)NC(=O)OCc1ccccc1)C(=O)NC(Cc1c[nH]c2ccccc12)C(N)=O