Reaction Details
TargetCollagenase 3
LigandBDBM50138686
Substrate/Competitorn/a
Meas. Tech.ChEMBL_106771 (CHEMBL717142)
Ki 200000±n/a nM
Citation Matziari, MBeau, FCuniasse, PDive, VYiotakis, A Evaluation of P1'-diversified phosphinic peptides leads to the development of highly selective inhibitors of MMP-11. J Med Chem47:325-36 (2004) 
 
Collagenase 3
Name:Collagenase 3
Type:Enzyme
Mol. Mass.:53808.06
Organism:Homo sapiens (Human)
Description:P45452
Residue:471
BDBM50138686
NameBDBM50138686
Synonyms:(1-Benzyloxycarbonylamino-2-phenyl-ethyl)-[2-[1-carbamoyl-2-(1H-indol-3-yl)-ethylcarbamoyl]-3-(2-trifluoromethoxy-phenylsulfanyl)-propyl]-phosphinic acid | CHEMBL323885
TypeSmall organic molecule
Emp. Form.C38H38F3N4O7PS
Mol. Mass.782.765
SMILESNC(=O)C(Cc1c[nH]c2ccccc12)NC(=O)C(CSc1ccccc1OC(F)(F)F)CP(O)(=O)C(Cc1ccccc1)NC(=O)OCc1ccccc1