Reaction Details
TargetBifunctional dihydrofolate reductase-thymidylate synthase
LigandBDBM50110760
Substrate/Competitorn/a
Meas. Tech.ChEMBL_155470 (CHEMBL769666)
IC50 50±n/a nM
Citation Sirichaiwat, CIntaraudom, CKamchonwongpaisan, SVanichtanankul, JThebtaranonth, YYuthavong, Y Target guided synthesis of 5-benzyl-2,4-diamonopyrimidines: their antimalarial activities and binding affinities to wild type and mutant dihydrofolate reductases from Plasmodium falciparum. J Med Chem47:345-54 (2004) 
 
Bifunctional dihydrofolate reductase-thymidylate synthase
Name:Bifunctional dihydrofolate reductase-thymidylate synthase
Type:Enzyme
Mol. Mass.:71822.51
Organism:Plasmodium falciparum (isolate K1 / Thailand)
Description:The mutant clone was prepared by cassette mutagenesis using wildtype pfDHFR as a template, and expressed in E. coli.
Residue:608
BDBM50110760
NameBDBM50110760
Synonyms:5-(3-methoxy-4-(3,4,5-trimethoxybenzyloxy)benzyl)pyrimidine-2,4-diamine CHEMBL22811
TypeSmall organic molecule
Emp. Form.C22H26N4O5
Mol. Mass.426.4656
SMILESCOc1cc(Cc2cnc(N)nc2N)ccc1OCc1cc(OC)c(OC)c(OC)c1