Reaction Details
TargetBifunctional dihydrofolate reductase-thymidylate synthase
LigandBDBM50138709
Substrate/Competitorn/a
Meas. Tech.ChEMBL_216587 (CHEMBL821379)
Ki 1.8±n/a nM
Citation Sirichaiwat, CIntaraudom, CKamchonwongpaisan, SVanichtanankul, JThebtaranonth, YYuthavong, Y Target guided synthesis of 5-benzyl-2,4-diamonopyrimidines: their antimalarial activities and binding affinities to wild type and mutant dihydrofolate reductases from Plasmodium falciparum. J Med Chem47:345-54 (2004) 
 
Bifunctional dihydrofolate reductase-thymidylate synthase
Name:Bifunctional dihydrofolate reductase-thymidylate synthase
Type:Enzyme
Mol. Mass.:71822.51
Organism:Plasmodium falciparum (isolate K1 / Thailand)
Description:The mutant clone was prepared by cassette mutagenesis using wildtype pfDHFR as a template, and expressed in E. coli.
Residue:608
BDBM50138709
NameBDBM50138709
Synonyms:5-(4-Methoxy-3-propoxy-benzyl)-pyrimidine-2,4-diamine | CHEMBL419231
TypeSmall organic molecule
Emp. Form.C15H20N4O2
Mol. Mass.288.3449
SMILESCCCOc1cc(Cc2cnc(N)nc2N)ccc1OC