Reaction Details
TargetHepatic triacylglycerol lipase
LigandBDBM50138737
Substrate/Competitorn/a
Meas. Tech.ChEMBL_100992 (CHEMBL707395)
IC50>50000±n/a nM
Citation Ebdrup, SSørensen, LGOlsen, OHJacobsen, P Synthesis and structure-activity relationship for a novel class of potent and selective carbamoyl-triazole based inhibitors of hormone sensitive lipase. J Med Chem47:400-10 (2004) 
 
Hepatic triacylglycerol lipase
Name:Hepatic triacylglycerol lipase
Type:Protein
Mol. Mass.:55938.55
Organism:Homo sapiens (Human)
Description:P11150
Residue:499
BDBM50138737
NameBDBM50138737
Synonyms:3-(4-Chloro-phenyl)-5-(2,2,2-trifluoro-ethylsulfanyl)-[1,2,4]triazole-1-carboxylic acid methyl-phenyl-amide CHEMBL131588
TypeSmall organic molecule
Emp. Form.C18H14ClF3N4OS
Mol. Mass.426.843
SMILESCN(C(=O)n1nc(nc1SCC(F)(F)F)-c1ccc(Cl)cc1)c1ccccc1