Reaction Details
TargetPancreatic triacylglycerol lipase
LigandBDBM50138739
Substrate/Competitorn/a
Meas. Tech.ChEMBL_152478 (CHEMBL760716)
IC50>10000±n/a nM
Citation Ebdrup, SSørensen, LGOlsen, OHJacobsen, P Synthesis and structure-activity relationship for a novel class of potent and selective carbamoyl-triazole based inhibitors of hormone sensitive lipase. J Med Chem47:400-10 (2004) 
 
Pancreatic triacylglycerol lipase
Name:Pancreatic triacylglycerol lipase
Type:PROTEIN
Mol. Mass.:51157.75
Organism:Homo sapiens (Human)
Description:ChEMBL_527250
Residue:465
BDBM50138739
NameBDBM50138739
Synonyms:4-tert-Butyl-N-[4-(5-methoxy-2-oxo-[1,3,4]oxadiazol-3-yl)-phenyl]-benzamide CHEMBL339297
TypeSmall organic molecule
Emp. Form.C20H21N3O4
Mol. Mass.367.3984
SMILESCOc1nn(-c2ccc(NC(=O)c3ccc(cc3)C(C)(C)C)cc2)c(=O)o1