Reaction Details
TargetHepatic triacylglycerol lipase
LigandBDBM50138751
Substrate/Competitorn/a
Meas. Tech.ChEMBL_100992 (CHEMBL707395)
IC50>50000±n/a nM
Citation Ebdrup, SSørensen, LGOlsen, OHJacobsen, P Synthesis and structure-activity relationship for a novel class of potent and selective carbamoyl-triazole based inhibitors of hormone sensitive lipase. J Med Chem47:400-10 (2004) 
 
Hepatic triacylglycerol lipase
Name:Hepatic triacylglycerol lipase
Type:Protein
Mol. Mass.:55938.55
Organism:Homo sapiens (Human)
Description:P11150
Residue:499
BDBM50138751
NameBDBM50138751
Synonyms:5-Methylsulfanyl-3-(4-trifluoromethoxy-phenyl)-[1,2,4]triazole-1-carboxylic acid methyl-phenyl-amide N-methyl-5-(methylthio)-N-phenyl-3-(4-(trifluoromethoxy)phenyl)-1H-1,2,4-triazole-1-carboxamide
TypeSmall organic molecule
Emp. Form.C18H15F3N4O2S
Mol. Mass.408.398
SMILESCSc1nc(nn1C(=O)N(C)c1ccccc1)-c1ccc(OC(F)(F)F)cc1