Reaction Details
TargetHormone-sensitive lipase
LigandBDBM50138739
Substrate/Competitorn/a
Meas. Tech.ChEMBL_88051 (CHEMBL693215)
IC50 23±n/a nM
Citation Ebdrup, SSørensen, LGOlsen, OHJacobsen, P Synthesis and structure-activity relationship for a novel class of potent and selective carbamoyl-triazole based inhibitors of hormone sensitive lipase. J Med Chem47:400-10 (2004) 
 
Hormone-sensitive lipase
Name:Hormone-sensitive lipase
Type:Protein
Mol. Mass.:116599.07
Organism:Homo sapiens (Human)
Description:Q05469
Residue:1076
BDBM50138739
NameBDBM50138739
Synonyms:4-tert-Butyl-N-[4-(5-methoxy-2-oxo-[1,3,4]oxadiazol-3-yl)-phenyl]-benzamide CHEMBL339297
TypeSmall organic molecule
Emp. Form.C20H21N3O4
Mol. Mass.367.3984
SMILESCOc1nn(-c2ccc(NC(=O)c3ccc(cc3)C(C)(C)C)cc2)c(=O)o1