Reaction Details
TargetPancreatic triacylglycerol lipase
LigandBDBM50138737
Substrate/Competitorn/a
Meas. Tech.ChEMBL_152478 (CHEMBL760716)
IC50>50000±n/a nM
Citation Ebdrup, SSørensen, LGOlsen, OHJacobsen, P Synthesis and structure-activity relationship for a novel class of potent and selective carbamoyl-triazole based inhibitors of hormone sensitive lipase. J Med Chem47:400-10 (2004) 
 
Pancreatic triacylglycerol lipase
Name:Pancreatic triacylglycerol lipase
Type:PROTEIN
Mol. Mass.:51157.75
Organism:Homo sapiens (Human)
Description:ChEMBL_527250
Residue:465
BDBM50138737
NameBDBM50138737
Synonyms:3-(4-Chloro-phenyl)-5-(2,2,2-trifluoro-ethylsulfanyl)-[1,2,4]triazole-1-carboxylic acid methyl-phenyl-amide CHEMBL131588
TypeSmall organic molecule
Emp. Form.C18H14ClF3N4OS
Mol. Mass.426.843
SMILESCN(C(=O)n1nc(nc1SCC(F)(F)F)-c1ccc(Cl)cc1)c1ccccc1