Reaction Details
TargetAcetylcholinesterase
LigandBDBM50138735
Substrate/Competitorn/a
Meas. Tech.ChEMBL_29411 (CHEMBL643384)
IC50 17000±n/a nM
Citation Ebdrup, SSørensen, LGOlsen, OHJacobsen, P Synthesis and structure-activity relationship for a novel class of potent and selective carbamoyl-triazole based inhibitors of hormone sensitive lipase. J Med Chem47:400-10 (2004) 
 
Acetylcholinesterase
Name:Acetylcholinesterase
Type:Enzyme
Mol. Mass.:67792.70
Organism:Homo sapiens (Human)
Description:P22303
Residue:614
BDBM50138735
NameBDBM50138735
Synonyms:(S)-4-isopropyl-3-methyl-2-(3-methylpiperidine-1-carbonyl)isoxazol-5(2H)-one CHEMBL106126
TypeSmall organic molecule
Emp. Form.C14H22N2O3
Mol. Mass.266.3361
SMILESCC(C)c1c(C)n(oc1=O)C(=O)N1CCC[C@H](C)C1