Reaction Details
TargetKappa-type opioid receptor
LigandBDBM50138777
Substrate/Competitorn/a
Meas. Tech.ChEMBL_145815 (CHEMBL753527)
Ki 1.33±n/a nM
Citation Vig, BSMurray, TFAldrich, JV Synthesis and opioid activity of side-chain-to-side-chain cyclic dynorphin A-(1-11) amide analogues cyclized between positions 2 and 5. 1. Substitutions in position 3. J Med Chem47:446-55 (2004) 
 
Kappa-type opioid receptor
Name:Kappa-type opioid receptor
Type:G Protein-Coupled Receptor (GPCR)
Mol. Mass.:42692.90
Organism:Rattus norvegicus (rat)
Description:P34975
Residue:380
BDBM50138777
NameBDBM50138777
Synonyms:CHEMBL414904 | cyclo[Trp3]Dyn A-(1-11)NH2
TypeSmall organic molecule
Emp. Form.C71H106N24O13
Mol. Mass.1503.7543
SMILESCC[C@H](C)[C@H](NC(=O)[C@H](CCCNC(N)=N)NC(=O)[C@H](CCCNC(N)=N)NC(=O)[C@H]1CNC(=O)C[C@@H](NC(=O)[C@@H](N)Cc2ccc(O)cc2)C(=O)N[C@@H](Cc2c[nH]c3ccccc23)C(=O)N[C@H](Cc2ccccc2)C(=O)N1)C(=O)N[C@@H](CCCNC(N)=N)C(=O)N1CCC[C@H]1C(=O)N[C@@H](CCCCN)C(N)=O