Reaction Details
TargetMetabotropic glutamate receptor 2
LigandBDBM50007548
Substrate/Competitorn/a
Meas. Tech.ChEMBL_106201 (CHEMBL713191)
EC50 448000.0±n/a nM
Citation Collado, IPedregal, CBueno, ABMarcos, AGonzález, RBlanco-Urgoiti, JPérez-Castells, JSchoepp, DDWright, RAJohnson, BGKingston, AEMoher, EDHoard, DWGriffey, KITizzano, JP (2S,1'S,2'R,3'R)-2-(2'-Carboxy-3'-hydroxymethylcyclopropyl) glycine is a highly potent group 2 and 3 metabotropic glutamate receptor agonist with oral activity. J Med Chem47:456-66 (2004) 
 
Metabotropic glutamate receptor 2
Name:Metabotropic glutamate receptor 2
Type:Enzyme
Mol. Mass.:95584.88
Organism:Homo sapiens (Human)
Description:Q14416
Residue:872
BDBM50007548
NameBDBM50007548
Synonyms:(S)-2-Amino-4-phosphono-butyric acid 2-Amino-3-(3,5-dioxo-[1,2,4]oxadiazolidin-2-yl)-propionic acid 2-Amino-4-phosphono-butyric acid(S-AP4) 2-amino-4-phosphonobutyric acid L-(+)-2-amino-4-phosphonobutyric acid L-AP4 | L-APB
TypeSmall organic molecule
Emp. Form.C4H10NO5P
Mol. Mass.183.0997
SMILESN[C@@H](CCP(O)(O)=O)C(O)=O