Reaction Details
TargetNeuromedin-K receptor
LigandBDBM50138823
Substrate/Competitorn/a
Meas. Tech.ChEMBL_209712 (CHEMBL816255)
Ki 97±n/a nM
Citation Albert, JSOhnmacht, CBernstein, PRRumsey, WLAharony, DAlelyunas, YRussell, DJPotts, WSherwood, SAShen, LDedinas, RFPalmer, WERussell, K Structural analysis and optimization of NK(1) receptor antagonists through modulation of atropisomer interconversion properties. J Med Chem47:519-29 (2004) 
 
Neuromedin-K receptor
Name:Neuromedin-K receptor
Type:Enzyme
Mol. Mass.:52221.96
Organism:Homo sapiens (Human)
Description:P29371
Residue:465
BDBM50138823
NameBDBM50138823
Synonyms:3-Cyano-2-ethyl-naphthalene-1-carboxylic acid ((S)-2-(3,4-dichloro-phenyl)-4-{4-[2-((S)-methanesulfinyl)-phenyl]-piperidin-1-yl}-butyl)-methyl-amide | CHEMBL149326
TypeSmall organic molecule
Emp. Form.C37H39Cl2N3O2S
Mol. Mass.660.695
SMILESCCc1c(cc2ccccc2c1C(=O)N(C)C[C@@H](CCN1CCC(CC1)c1ccccc1[S@](C)=O)c1ccc(Cl)c(Cl)c1)C#N