Reaction Details
TargetCathepsin K
LigandBDBM50138866
Substrate/Competitorn/a
Meas. Tech.ChEMBL_45540 (CHEMBL656670)
IC50 0.41±n/a nM
Citation Tavares, FXBoncek, VDeaton, DNHassell, AMLong, STMiller, ABPayne, AAMiller, LRShewchuk, LMWells-Knecht, KWillard, DHWright, LLZhou, HQ Design of potent, selective, and orally bioavailable inhibitors of cysteine protease cathepsin k. J Med Chem47:588-99 (2004) 
 
Cathepsin K
Name:Cathepsin K
Type:Enzyme
Mol. Mass.:36975.68
Organism:Homo sapiens (Human)
Description:P43235
Residue:329
BDBM50138866
NameBDBM50138866
Synonyms:CHEMBL156764 | [(S)-1-(1-Methyl-1H-pyrazol-3-ylaminooxalyl)-pentyl]-carbamic acid 1-isopropyl-2-methyl-propyl ester
TypeSmall organic molecule
Emp. Form.C19H32N4O4
Mol. Mass.380.4818
SMILESCCCC[C@H](NC(=O)OC(C(C)C)C(C)C)C(=O)C(=O)Nc1ccn(C)n1