Reaction Details
TargetCathepsin K
LigandBDBM50138870
Substrate/Competitorn/a
Meas. Tech.ChEMBL_45540 (CHEMBL656670)
IC50 0.91±n/a nM
Citation Tavares, FXBoncek, VDeaton, DNHassell, AMLong, STMiller, ABPayne, AAMiller, LRShewchuk, LMWells-Knecht, KWillard, DHWright, LLZhou, HQ Design of potent, selective, and orally bioavailable inhibitors of cysteine protease cathepsin k. J Med Chem47:588-99 (2004) 
 
Cathepsin K
Name:Cathepsin K
Type:Enzyme
Mol. Mass.:36975.68
Organism:Homo sapiens (Human)
Description:P43235
Residue:329
BDBM50138870
NameBDBM50138870
Synonyms:CHEMBL347004 | [(S)-1-(4-Cyano-1H-pyrazol-3-ylaminooxalyl)-pentyl]-carbamic acid 1-isopropyl-2-methyl-propyl ester
TypeSmall organic molecule
Emp. Form.C19H29N5O4
Mol. Mass.391.4647
SMILESCCCC[C@H](NC(=O)OC(C(C)C)C(C)C)C(=O)C(=O)Nc1[nH]ncc1C#N