Reaction Details
TargetCannabinoid receptor 1
LigandBDBM50138897
Substrate/Competitorn/a
Meas. Tech.ChEMBL_46448 (CHEMBL657896)
Ki 21.8±n/a nM
Citation Lange, JHCoolen, HKvan Stuivenberg, HHDijksman, JAHerremans, AHRonken, EKeizer, HGTipker, KMcCreary, ACVeerman, WWals, HCStork, BVerveer, PCden Hartog, APde Jong, NMAdolfs, TJHoogendoorn, JKruse, CG Synthesis, biological properties, and molecular modeling investigations of novel 3,4-diarylpyrazolines as potent and selective CB(1) cannabinoid receptor antagonists. J Med Chem47:627-43 (2004) 
 
Cannabinoid receptor 1
Name:Cannabinoid receptor 1
Type:G Protein-Coupled Receptor (GPCR)
Mol. Mass.:52868.96
Organism:Homo sapiens (Human)
Description:P21554
Residue:472
BDBM50138897
NameBDBM50138897
Synonyms:CHEMBL351123 | Naphthalene-2-sulfonic acid 1-[3-(4-chloro-phenyl)-4-phenyl-4,5-dihydro-pyrazol-1-yl]-1-methylamino-meth-(E)-ylideneamide
TypeSmall organic molecule
Emp. Form.C27H23ClN4O2S
Mol. Mass.503.015
SMILESCN=C(NS(=O)(=O)c1ccc2ccccc2c1)N1CC(C(=N1)c1ccc(Cl)cc1)c1ccccc1