Reaction Details
TargetCannabinoid receptor 1
LigandBDBM50138903
Substrate/Competitorn/a
Meas. Tech.ChEMBL_46448 (CHEMBL657896)
Ki 16.6±n/a nM
Citation Lange, JHCoolen, HKvan Stuivenberg, HHDijksman, JAHerremans, AHRonken, EKeizer, HGTipker, KMcCreary, ACVeerman, WWals, HCStork, BVerveer, PCden Hartog, APde Jong, NMAdolfs, TJHoogendoorn, JKruse, CG Synthesis, biological properties, and molecular modeling investigations of novel 3,4-diarylpyrazolines as potent and selective CB(1) cannabinoid receptor antagonists. J Med Chem47:627-43 (2004) 
 
Cannabinoid receptor 1
Name:Cannabinoid receptor 1
Type:G Protein-Coupled Receptor (GPCR)
Mol. Mass.:52868.96
Organism:Homo sapiens (Human)
Description:P21554
Residue:472
BDBM50138903
NameBDBM50138903
Synonyms:CHEMBL350924 | N-[1-[3-(4-Chloro-phenyl)-4-phenyl-4,5-dihydro-pyrazol-1-yl]-1-methylsulfanyl-meth-(Z)-ylidene]-4-trifluoromethyl-benzenesulfonamide
TypeSmall organic molecule
Emp. Form.C24H19ClF3N3O2S2
Mol. Mass.538.005
SMILESCSC(=NS(=O)(=O)c1ccc(cc1)C(F)(F)F)N1CC(C(=N1)c1ccc(Cl)cc1)c1ccccc1