Reaction Details
TargetCannabinoid receptor 2
LigandBDBM50138912
Substrate/Competitorn/a
Meas. Tech.ChEMBL_46977 (CHEMBL659744)
Ki>1000±n/a nM
Citation Lange, JHCoolen, HKvan Stuivenberg, HHDijksman, JAHerremans, AHRonken, EKeizer, HGTipker, KMcCreary, ACVeerman, WWals, HCStork, BVerveer, PCden Hartog, APde Jong, NMAdolfs, TJHoogendoorn, JKruse, CG Synthesis, biological properties, and molecular modeling investigations of novel 3,4-diarylpyrazolines as potent and selective CB(1) cannabinoid receptor antagonists. J Med Chem47:627-43 (2004) 
 
Cannabinoid receptor 2
Name:Cannabinoid receptor 2
Type:G Protein-Coupled Receptor (GPCR)
Mol. Mass.:39690.94
Organism:Homo sapiens (Human)
Description:P34972
Residue:360
BDBM50138912
NameBDBM50138912
Synonyms:CHEMBL156556 | N-[1-Amino-1-[3-(4-chloro-phenyl)-4-phenyl-4,5-dihydro-pyrazol-1-yl]-meth-(E)-ylidene]-2,4,6-trimethyl-benzenesulfonamide
TypeSmall organic molecule
Emp. Form.C25H25ClN4O2S
Mol. Mass.481.01
SMILESCc1cc(C)c(c(C)c1)S(=O)(=O)NC(=N)N1CC(C(=N1)c1ccc(Cl)cc1)c1ccccc1