Reaction Details
TargetcGMP-specific 3',5'-cyclic phosphodiesterase
LigandBDBM50138927
Substrate/Competitorn/a
Meas. Tech.ChEMBL_155353 (CHEMBL762498)
Ki 0.580000±n/a nM
Citation Lanter, JCSui, ZMacielag, MJFiordeliso, JJJiang, WQiu, YBhattacharjee, SKraft, PJohn, TMHaynes-Johnson, DCraig, EClancy, J Structure-activity relationships of N-acyl pyrroloquinolone PDE-5 inhibitors. J Med Chem47:656-62 (2004) 
 
cGMP-specific 3',5'-cyclic phosphodiesterase
Name:cGMP-specific 3',5'-cyclic phosphodiesterase
Type:Protein
Mol. Mass.:99975.83
Organism:Homo sapiens (Human)
Description:O76074
Residue:875
BDBM50138927
NameBDBM50138927
Synonyms:3-Benzo[1,3]dioxol-5-yl-9-oxo-1,3,4,9-tetrahydro-pyrrolo[3,4-b]quinoline-2-carboxylic acid benzyl ester | CHEMBL157819
TypeSmall organic molecule
Emp. Form.C26H20N2O5
Mol. Mass.440.4474
SMILESOc1c2CN(C(c2nc2ccccc12)c1ccc2OCOc2c1)C(=O)OCc1ccccc1