Reaction Details
TargetcGMP-specific 3',5'-cyclic phosphodiesterase
LigandBDBM50138930
Substrate/Competitorn/a
Meas. Tech.ChEMBL_155353 (CHEMBL762498)
Ki 0.220000±n/a nM
Citation Lanter, JCSui, ZMacielag, MJFiordeliso, JJJiang, WQiu, YBhattacharjee, SKraft, PJohn, TMHaynes-Johnson, DCraig, EClancy, J Structure-activity relationships of N-acyl pyrroloquinolone PDE-5 inhibitors. J Med Chem47:656-62 (2004) 
 
cGMP-specific 3',5'-cyclic phosphodiesterase
Name:cGMP-specific 3',5'-cyclic phosphodiesterase
Type:Protein
Mol. Mass.:99975.83
Organism:Homo sapiens (Human)
Description:O76074
Residue:875
BDBM50138930
NameBDBM50138930
Synonyms:3-Benzo[1,3]dioxol-5-yl-2-(3-phenyl-acryloyl)-1,2,3,4-tetrahydro-pyrrolo[3,4-b]quinolin-9-one | CHEMBL158374
TypeSmall organic molecule
Emp. Form.C27H20N2O4
Mol. Mass.436.4587
SMILESOc1c2CN(C(c2nc2ccccc12)c1ccc2OCOc2c1)C(=O)C=Cc1ccccc1