Reaction Details
TargetBifunctional dihydrofolate reductase-thymidylate synthase
LigandBDBM50138957
Substrate/Competitorn/a
Meas. Tech.ChEMBL_155799 (CHEMBL765484)
IC50 5900±n/a nM
Citation Kamchonwongpaisan, SQuarrell, RCharoensetakul, NPonsinet, RVilaivan, TVanichtanankul, JTarnchompoo, BSirawaraporn, WLowe, GYuthavong, Y Inhibitors of multiple mutants of Plasmodium falciparum dihydrofolate reductase and their antimalarial activities. J Med Chem47:673-80 (2004) 
 
Bifunctional dihydrofolate reductase-thymidylate synthase
Name:Bifunctional dihydrofolate reductase-thymidylate synthase
Type:Enzyme
Mol. Mass.:71822.51
Organism:Plasmodium falciparum (isolate K1 / Thailand)
Description:The mutant clone was prepared by cassette mutagenesis using wildtype pfDHFR as a template, and expressed in E. coli.
Residue:608
BDBM50138957
NameBDBM50138957
Synonyms:CHEMBL352441 benzyl 3-(2,6-diamino-5-(3-chlorophenyl)pyrimidin-4-yl)propyl carbonate
TypeSmall organic molecule
Emp. Form.C21H21ClN4O3
Mol. Mass.412.869
SMILESNc1nc(N)c(c(CCCOC(=O)OCc2ccccc2)n1)-c1cccc(Cl)c1