Reaction Details
TargetBifunctional dihydrofolate reductase-thymidylate synthase
LigandBDBM50138946
Substrate/Competitorn/a
Meas. Tech.ChEMBL_155800 (CHEMBL765485)
IC50 2800±n/a nM
Citation Kamchonwongpaisan, SQuarrell, RCharoensetakul, NPonsinet, RVilaivan, TVanichtanankul, JTarnchompoo, BSirawaraporn, WLowe, GYuthavong, Y Inhibitors of multiple mutants of Plasmodium falciparum dihydrofolate reductase and their antimalarial activities. J Med Chem47:673-80 (2004) 
 
Bifunctional dihydrofolate reductase-thymidylate synthase
Name:Bifunctional dihydrofolate reductase-thymidylate synthase
Type:Enzyme
Mol. Mass.:71822.51
Organism:Plasmodium falciparum (isolate K1 / Thailand)
Description:The mutant clone was prepared by cassette mutagenesis using wildtype pfDHFR as a template, and expressed in E. coli.
Residue:608
BDBM50138946
NameBDBM50138946
Synonyms:1-(3-Chloro-phenyl)-6-[3-(3-trifluoromethyl-phenoxy)-phenyl]-1,6-dihydro-[1,3,5]triazine-2,4-diamine CHEMBL348151
TypeSmall organic molecule
Emp. Form.C22H17ClF3N5O
Mol. Mass.459.851
SMILESNC1=NC(N(C(N)=N1)c1cccc(Cl)c1)c1cccc(Oc2cccc(c2)C(F)(F)F)c1